TC-SHE-100029-CTI-gal-bg-MomentsML-exp-108853

Table of Contents

  1. General Information
  2. Results and Figures
    1. Bin 0
      1. Slope Test Result
      2. Intercept Test Result
    2. Bin 1
      1. Slope Test Result
      2. Intercept Test Result
    3. Bin 2
      1. Slope Test Result
      2. Intercept Test Result
    4. Bin 3
      1. Slope Test Result
      2. Intercept Test Result

General Information

Test Case ID: TC-SHE-100029-CTI-gal-bg-MomentsML

Description: Linear dependence of residual galaxy ellipticity with read-out register distance (slope). Binned by background level. Shear estimation method: ShearEstimationMethods.MOMENTSML.

Result: FAILED

Results and Figures

Error reported: Test failed due to NaN regression results for slope.

Bin 0

No figure for this bin.

Bin limits: -1e+99 to 33.83364677429199.

Slope Test Result

Slope = nan +/- nan

Z(Slope) = nan (Max allowed: 5.80)

Slope result: FAILED

Intercept Test Result

Intercept = nan +/- nan

Z(Intercept) = nan (Max allowed: 5.80)

Intercept result: FAILED

Bin 1

No figure for this bin.

Bin limits: 33.83364677429199 to 33.86515235900879.

Slope Test Result

Slope = nan +/- nan

Z(Slope) = nan (Max allowed: 5.80)

Slope result: FAILED

Intercept Test Result

Intercept = nan +/- nan

Z(Intercept) = nan (Max allowed: 5.80)

Intercept result: FAILED

Bin 2

No figure for this bin.

Bin limits: 33.86515235900879 to 33.90315818786621.

Slope Test Result

Slope = nan +/- nan

Z(Slope) = nan (Max allowed: 5.80)

Slope result: FAILED

Intercept Test Result

Intercept = nan +/- nan

Z(Intercept) = nan (Max allowed: 5.80)

Intercept result: FAILED

Bin 3

No figure for this bin.

Bin limits: 33.90315818786621 to 1e+99.

Slope Test Result

Slope = nan +/- nan

Z(Slope) = nan (Max allowed: 5.80)

Slope result: FAILED

Intercept Test Result

Intercept = nan +/- nan

Z(Intercept) = nan (Max allowed: 5.80)

Intercept result: FAILED

results matching ""

    No results matching ""