TC-SHE-100018-shear-bias-c-REGAUSS-BG

Table of Contents

  1. General Information
  2. Results and Figures
    1. Bin 0
      1. c1 Test Result
      2. c2 Test Result
    2. Bin 1
      1. c1 Test Result
      2. c2 Test Result
    3. Bin 2
      1. c1 Test Result
      2. c2 Test Result
    4. Bin 3
      1. c1 Test Result
      2. c2 Test Result

General Information

Test Case ID: TC-SHE-100018-shear-bias-c-REGAUSS

Description: Additive shear bias. Binned by background level. Shear estimation method: ShearEstimationMethods.REGAUSS.

Result: PASSED

Results and Figures

Error reported: Test failed due to NaN regression results.

Error reported: Test failed due to NaN regression results.

Bin 0

Bin limits: -1e+99 to 33.83562660217285.

c1 Test Result

No figure for this bin.

c1 = nan +/- nan

Z(c1) = 0.00000000 (Max allowed: 5.91041255)

c1 result: FAILED

c2 Test Result

No figure for this bin.

c2 = nan +/- nan

Z(c2) = 0.00000000 (Max allowed: 5.91041255)

c2 result: FAILED

Bin 1

Bin limits: 33.83562660217285 to 33.866079330444336.

c1 Test Result

No figure for this bin.

c1 = nan +/- nan

Z(c1) = 0.00000000 (Max allowed: 5.91041255)

c1 result: FAILED

c2 Test Result

No figure for this bin.

c2 = nan +/- nan

Z(c2) = 0.00000000 (Max allowed: 5.91041255)

c2 result: FAILED

Bin 2

Bin limits: 33.866079330444336 to 33.90309715270996.

c1 Test Result

No figure for this bin.

c1 = nan +/- nan

Z(c1) = 0.00000000 (Max allowed: 5.91041255)

c1 result: FAILED

c2 Test Result

No figure for this bin.

c2 = nan +/- nan

Z(c2) = 0.00000000 (Max allowed: 5.91041255)

c2 result: FAILED

Bin 3

Bin limits: 33.90309715270996 to 1e+99.

c1 Test Result

No figure for this bin.

c1 = nan +/- nan

Z(c1) = 0.00000000 (Max allowed: 5.91041255)

c1 result: FAILED

c2 Test Result

No figure for this bin.

c2 = nan +/- nan

Z(c2) = 0.00000000 (Max allowed: 5.91041255)

c2 result: FAILED

results matching ""

    No results matching ""