TC-SHE-100017-shear-bias-m-MomentsML-SNR

Table of Contents

  1. General Information
  2. Results and Figures
    1. Bin 0
      1. m1 Test Result
      2. m2 Test Result
    2. Bin 1
      1. m1 Test Result
      2. m2 Test Result
    3. Bin 2
      1. m1 Test Result
      2. m2 Test Result
    4. Bin 3
      1. m1 Test Result
      2. m2 Test Result

General Information

Test Case ID: TC-SHE-100017-shear-bias-m-MomentsML

Description: Multiplicative shear bias. Binned by SNR. Shear estimation method: ShearEstimationMethods.MOMENTSML.

Result: PASSED

Results and Figures

Error reported: Test failed due to NaN regression results.

Error reported: Test failed due to NaN regression results.

Bin 0

Bin limits: -1e+99 to 1.0000221729278564.

m1 Test Result

Bin 0 m1 Figure

m1 = inf +/- nan

Z(m1) = nan (Max allowed: 5.91041255)

m1 result: FAILED

m2 Test Result

Bin 0 m2 Figure

m2 = inf +/- nan

Z(m2) = nan (Max allowed: 5.91041255)

m2 result: FAILED

Bin 1

Bin limits: 1.0000221729278564 to 5.527604341506958.

m1 Test Result

Bin 1 m1 Figure

m1 = inf +/- nan

Z(m1) = nan (Max allowed: 5.91041255)

m1 result: FAILED

m2 Test Result

Bin 1 m2 Figure

m2 = inf +/- nan

Z(m2) = nan (Max allowed: 5.91041255)

m2 result: FAILED

Bin 2

Bin limits: 5.527604341506958 to 13.074265241622925.

m1 Test Result

Bin 2 m1 Figure

m1 = inf +/- nan

Z(m1) = nan (Max allowed: 5.91041255)

m1 result: FAILED

m2 Test Result

Bin 2 m2 Figure

m2 = inf +/- nan

Z(m2) = nan (Max allowed: 5.91041255)

m2 result: FAILED

Bin 3

Bin limits: 13.074265241622925 to 1e+99.

m1 Test Result

Bin 3 m1 Figure

m1 = inf +/- nan

Z(m1) = nan (Max allowed: 5.91041255)

m1 result: FAILED

m2 Test Result

Bin 3 m2 Figure

m2 = inf +/- nan

Z(m2) = nan (Max allowed: 5.91041255)

m2 result: FAILED

results matching ""

    No results matching ""